{"text_format":"1","workbook":"xlsx","n_sheets":5,"sheets":["5 Authorization Planogram List ","New Item Form","DSD Store Assortment and Cost","DROP DOWN BOX SOURCE","Shipper Component form"],"not_rendered":{"charts":0,"images":0,"macros":1,"external_links":0,"defined_names":11,"comments":2,"pivot_tables":0},"unopened":[],"bounds":{"document_bytes":16777216,"sheet_cells":100000,"rows_first":2000,"rows_last":500,"rows_between":2000,"halvings":0,"cell_chars":16384,"cell_head_chars":4096},"cells_cut":0,"cells_raw":0,"read":"whole","date_system":"1900"}

{"sheet":"5 Authorization Planogram List ","index":0,"n_rows":29,"n_cols":2,"rows_kept":29,"cut":false,"hidden":true,"merged":[]}
["Sctn Desc","Assigned to all stores unless specified "]
["1 DISCO PROMO_ALL BANNERS & DC'S","Used for deleted product to be allocated or code changes "]
["1 IN & OUT","Used for temp items 3 months or less"]
["1 SHIPPERS & PALLETS_ALL BANNERS & DCs","Used for allocation of shippers, pallets or modules "]
["2 BAKERY_ALL BANNERS & DC'S","Authorization for Bakery items Only "]
["2 DELI_ALL BANNERS & DC'S","Authorization for Deli  items Only "]
["2 DSD AIR FILTERS_ALL BANNERS & DC'S","Authorization for DSD Air Filter items not Planogramed "]
["2 DSD BREAD AND SWEET GOODS PROMO_ALL BANNERS & DC'S","Authorization for  DSD Bread and Sweet Goods "]
["2 DSD CHIPS_ALL BANNERS & DC'S","Authorization for  DSD Chips not Planogrammed "]
["2 DSD CLIPS STRIPS_ALL BANNERS & DC'S","Authorization for  DSD Clip Strip items "]
["2 DSD CSD_ALL BANNERS & DCs","Authorization for  DSD CSD items not planogrammed "]
["2 DSD KOSHER_ALL BANNERS & DC'S","Authorization for  DSD Kosher items not Planogrammed, "]
["2 DSD LOCAL_ALL BANNERS & DC'S","Authorization for  DSD local item not Planogrammed "]
["2 DSD PRODUCE_ALL BANNERS & DC'S","Authorization for  Produce items only "]
["2 DSD SNACKS_ALL BANNERS & DC'S","Authorization for  DSD Snack (Cookies / Crackers) items not Planogrammed "]
["2 DSD SPIRITS_ALL BANNERS & DC'S","Authorization for  DSD Spirit "]
["2 FALL_ALL BANNERS & DCs","Authorization for Fall items we carry only during this time "]
["2 Fire Wood_04X72_ALL BANNERS & DCS","Authorization for Seasonal firelogs not planogramed "]
["2 Fresco ","Authorization for Items not planogrammed for Fresco stores only "]
["2 HURRICANE EMERGENCY_ALL BANNERS & DC'S","Authorization for all Hurricane emergency items "]
["2 MARKET SEAFOOD_ALL BANNERS & DC'S","Authorization for Seafood Market items only "]
["2 MEAT_ALL BANNERS & DC'S","Authorization for Meat Market items only "]
["2 OWN BRANDS CC_ALL BANNERS & DCs","Authorization for Code Changes for Own Brands "]
["2 PHARMACY_ALL BANNERS & DC'S","Authorization for Pharmacy items not planogrammed "]
["2 SPRING_ALL BANNERS & DCs","Authorization for Spring  items we carry only during this time "]
["2 SUMMER_ALL BANNERS & DCs","Authorization for Summer items we carry only during this time "]
["2 TOBACCO_ALL BANNERS & DC'S","Authorization for Tobacco items not planogrammed   "]
["2 WINTER_ALL BANNERS & DCs","Authorization for Winter items we carry only during this time "]
["z 0002_Store Promo_","Customer Request only "]

{"sheet":"New Item Form","index":1,"n_rows":275,"n_cols":66,"rows_kept":275,"cut":false,"hidden":false,"merged":[[49,21,49,24],[45,21,45,24],[46,21,46,24],[27,6,27,8],[27,9,27,11],[27,12,27,14],[27,15,27,17],[27,18,27,20],[46,3,46,10],[47,21,47,24],[29,6,29,8],[29,9,29,11],[29,12,29,14],[29,15,29,17],[29,18,29,20],[28,6,28,8],[28,9,28,11],[28,12,28,14],[28,15,28,17],[28,18,28,20],[6,30,6,37],[6,24,6,29],[4,2,4,7],[4,8,4,18],[24,30,24,33],[25,26,25,29],[25,30,25,33],[25,18,25,20],[25,6,25,8],[24,9,24,11],[25,9,25,11],[24,12,24,14],[25,12,25,14],[24,15,24,17],[25,15,25,17],[23,6,23,8],[23,9,23,11],[23,12,23,14],[23,15,23,17],[23,18,23,20],[24,6,24,8],[24,3,24,5],[25,3,25,5],[9,24,9,32],[23,23,23,29],[23,30,23,34],[24,26,24,29],[61,2,61,37],[52,9,52,16],[52,17,52,18],[54,2,55,18],[38,4,38,12],[39,30,39,32],[40,16,40,24],[28,3,28,5],[29,3,29,5],[52,20,55,37],[26,24,26,29],[26,30,26,37],[34,34,34,35],[34,15,34,16],[34,18,34,20],[34,22,34,23],[34,25,34,26],[34,28,34,29],[34,31,34,32],[36,2,36,37],[48,21,48,24],[62,2,62,37],[63,2,63,6],[63,7,63,21],[63,22,63,23],[63,24,63,37],[56,32,56,37],[57,2,57,37],[58,2,58,13],[58,17,58,37],[59,2,59,37],[60,2,60,37],[58,14,58,16],[1,2,1,37],[2,2,2,37],[7,2,7,37],[16,3,16,16],[17,3,17,16],[12,3,12,16],[13,3,13,16],[28,23,28,29],[28,30,28,34],[8,2,8,12],[8,13,8,37],[3,2,3,12],[3,13,3,37],[6,2,6,7],[6,8,6,12],[5,2,5,7],[5,8,5,18],[24,18,24,20],[15,2,15,4],[20,2,20,37],[9,2,9,5],[9,6,9,16],[9,18,9,23],[11,29,11,37],[4,19,4,24],[4,25,4,37],[5,19,5,24],[5,25,5,37],[33,2,33,16],[34,2,34,14],[6,21,6,23],[6,13,6,20],[19,3,19,13],[19,14,19,18],[29,30,29,34],[31,30,31,34],[31,20,31,29],[31,3,31,9],[31,10,31,14],[33,17,33,18],[33,20,33,21],[33,23,33,25],[33,27,33,29],[29,23,29,29],[12,20,18,28],[12,29,18,37],[11,20,11,28],[11,2,11,4]]}
[]
[null,null,"SOUTHEASTERN GROCERS NEW ITEM AGREEMENT"]
[null,null,"FIELDS THAT ARE GRAYED OUT INDICATE THAT THE FIELD IS TO BE COMPLETED BY A SEG ASSOCIATE."]
[null,null,"SUPPLIER ITEM DESCRIPTION ",null,null,null,null,null,null,null,null,null,null," "]
[null,null,"VENDOR NAME",null,null,null,null,null," ",null,null,null,null,null,null,null,null,null,null,"Representative's Name"]
[null,null,"VENDOR NUMBER",null,null,null,null,null," ",null,null,null,null,null,null,null,null,null,null,"Phone Number",null,null,null,null,null,null,null,null,null,null,null,null,null,null,null,null,null,null,null,null,null,null,null,null,null,null,null,null,null,null,null,null,null,null,null,null,null,null,null,null,null,null,"13 TOM BARR"]
[null,null,"SEG ITEM NUMBER",null,null,null,null,null," ",null,null,null,null,"FIRST DATE AVAILABLE TO SHIP",null,null,null,null,null,null,null,null,null,null,"MODEL CODE",null,null,null,null,null," "]
[null,null,"Retail Data"]
[null,null,"POINT OF SALE DESCRIPTION"]
[null,null,"RETAIL SIZE",null,null,null,null,null,null,null,null,null,null,null,null,null,null,null,"Retail Unit of Measure"]
[]
[null,null,"UNIT UPC",null,null,null,null,null,null,null,null,null,null,null,null,null,null,null,null,null,"UNIT UPC PICTURE",null,null,null,null,null,null,null,null,"CASE UPC PICTURE"]
[null,null,null,"ATTACHED PHOTO COPY OF UPC BAR CODE REQUIRED"]
[null,null,null,"Check Digit is required for UNIT UPCs"]
[]
[null,null,"CASE UPC"]
[null,null,null,"ATTACHED PHOTO COPY OF UPC BAR CODE REQUIRED"]
[null,null,null,"Check Digit is required for CASE UPCs"]
[]
[null,null,null,"Is this item in Syndigo DataSync Provider?"]
[null,null,"Logistic Data"]
[]
[]
[null,null,null,null,null,null,"PACK (Coeff)",null,null,"LENGTH (in)",null,null,"WIDTH (in)",null,null,"HEIGHT (in)",null,null,"WEIGHT (lbs)",null,null,null,null,"MANUFACTURER CODE ( SKU )",null,null,null,null,null,null," "]
[null,null,null,"MSTR",null,null,null,null,null,null,null,null,null,null,null,null,null,null,null,null,null,null,null,null,null,null,"SHIP COST"]
[null,null,null,"SHIP",null,null,null,null,null,null,null,null,null,null,null,null,null,null,null,null,null,null,null,null,null,null,"UNIT COST",null,null,null,{"$f":"IFERROR(ROUND(AE25/G26,2),\"\")","v":""}]
[null,null,null,null,null,null,null,null,null,null,null,null,null,null,null,null,null,null,null,null,null,null,null,null,"PACKAGING"]
[null,null,null,null,null,null,"PACK (Coeff)",null,null,"LENGTH (in)",null,null,"WIDTH (in)",null,null,"HEIGHT (in)",null,null,"WEIGHT (lbs)"]
[null,null,null,"TIE ",null,null,null,null,null,null,null,null,null,null,null,null,null,null,null,null,null,null,null,"DSD Invoice Sequence Num",null,null,null,null,null,null," "]
[null,null,null,"TIER",null,null,null,null,null,null,null,null,null,null,null,null,null,null,null,null,null,null,null,"DSD Vendor Sku",null,null,null,null,null,null," "]
[]
[null,null,null,"Company Product Y/N",null,null,null,null,null,null," ",null,null,null,null,null,null,null,null,null,"Existing SEG Code if a replacement item",null,null,null,null,null,null,null,null,null," "]
[null,null,null,null," ",null,null,null,null,null,null,null,null,null,null,null,null,null,null,null,null,null,null,null,null,null,null,null,null,null,null,null,null,null,null,null,null,null,null,null,null,null,null,null,null,null,null,null,null,null,null,null,null,null,null,null,null,null,null,{"$f":"IF(AND(#REF!=216,OR(#REF!=\"16\",#REF!=\"25\",#REF!=\"41\",#REF!=\"43\")),1,0)","v":{"$error":"#REF!"}},216,4,"79 ERIC HAINES","20839","GM CONTINUITY","CONTAINER, TIN"]
[null,null,"ITEM TO BE AUTHORIZED FOR BANNERS AS INDICATED: (X)",null,null,null,null,null,null,null,null,null,null,null,null,null,null,"WD",null," ","BILO",null," ","HARVEY'S",null,null," ","ALL"]
[null,null,"ITEM WILL BE AUTHORIZED IN THE FOLLOWING DC'S",null,null,null,null,null,null,null,null,null,null,null,null,"JAX",null," ","Plant City",null,null," ","MIA",null,null,"MAU",null,null,"NOL",null,null,"FAC 19",null," ","GMD",null,null,null,null,null,null,null,null,null,null,null,null,null,null,null,null,null,null,null,null,null,null,null,null,null,null,null,"N"]
[]
[null,null,"Pricing Data"]
[null,null,"INITIAL RECOMMENDED UNIT RETAIL PRICING",null,null,null,null,null,null,null,null,null,null,null,null,null,null,null,null,null,null,null,null,null,null,null,null,null,null,null,null,null,null,null,null,null,null,null,null,null,null,null,null,null,null,null,null,null,null,null,null,null,null,null,null,null,null,null,null,null,null,null,"WHS PALLET"]
[null,null,null,null,null,null,null,null,null,null,null,null,null,null,null,null,null,null,null,null,null,null,null,null,null,null,null,null,null,null,null,null,null,null,null,null,null,null,null,null,null,null,null,null,null,null,null,null,null,null,null,null,null,null,null,null,null,null,null,null,null,null,"UNITS"]
[null,null,null,null,null,null,null,null,null,null,null,null,null,null,null,null,null,null,null,null,null,"PRE-PRICED ITEM Y/N  "," ",null,null,null,null,null,null,"PRE-PRICED PRICE  "," "]
[]
[]
[null,null,"If not Pre-priced, then enter a \"RECOMMENDED\" Retail Price "]
[]
[]
[null,null,null,null,null,null,null,null,null,null,null,null,null,null,null,null,null,"WINN DIXIE"]
[null,null,null,null,null,null,null,null,null,null,null,null,null,null,null,null,null,"WINN DIXIE"]
[null,null,null,null,null,null,null,null,null,null,null,null,null,null,null,null,null,"BI-LO"]
[null,null,null,null,null,null,null,null,null,null,null,null,null,null,null,null,null,"HARVEYS"]
[null,null,null,null,null,null,null,null,null,null,null,null,null,null,null,null,null,"Fresco Y Mas"]
[]
[]
[null,null,null,null,null,null,null,null,null,null,null,null,null,null,null,null,null,null,null,null,null,null,null,null,null,null,null,null,null,null,null,null,null,null,null,null,null,null,null,null,null,null,null,null,null,null,null,null,null,null,null,null,null,null,null,null,null,null,null,{"$f":"IF(AND(#REF!=302,OR(#REF!=\"01\",#REF!=\"15\",#REF!=\"40\",#REF!=\"50\",#REF!=\"60\",#REF! =\"99\")),1,0)","v":{"$error":"#REF!"}},302,5,"80 CHARLIE VAN PELT","20845","GM SEASONAL","ENVELOPE/POUCH, PAPER"]
[null,null,null,"CATEGORY MANAGER APPROVAL",null,null,null,null,null,null,null,null,null,null,null,null,null,null,null,null,null,null,null,null,null,null,null,null,null,null,null,null,null,null,null,null,null,null,null,null,null,null,null,null,null,null,null,null,null,null,null,null,null,null,null,null,null,null,null,{"$f":"IF(AND(#REF!=310,#REF! =\"25\"),1,0)","v":{"$error":"#REF!"}},310,1,"81 MIKE JEFFREYS","20860","PHOTO LAB","ENVELOPE/POUCH, PLASTIC"]
[null,null,null,null,null,null,null,null,null,null,null,null,null,null,null,null,null,null,null,null,null,null,null,null,null,null,null,null,null,null,null,null,null,null,null,null,null,null,null,null,null,null,null,null,null,null,null,null,null,null,null,null,null,null,null,null,null,null,null,{"$f":"IF(AND(#REF!=312,OR(#REF!=\"23\",#REF!=\"24\",#REF!=\"25\",#REF!=\"40\",#REF! =\"41\",#REF!=\"44\",#REF!=\"50\")),1,0)","v":{"$error":"#REF!"}},312,7,"82 JEFF ELWELL","21024","PHOTO LAB SUPPLIES","KEG, STAINLESS STEEL"]
[null,null,null,null,null,null,null,null,null,null,null,null,null,null,null,null,null,null,null,null,null,null,null,null,null,null,null,null,null,null,null,null,null,null,null,null,null,null,null,null,null,null,null,null,null,null,null,null,null,null,null,null,null,null,null,null,null,null,null,{"$f":"IF(AND(#REF!=403,OR(#REF!=\"02\",#REF!=\"12\",#REF!=\"15\",#REF!=\"19\",#REF! =\"68\",#REF!=\"99\")),1,0)","v":{"$error":"#REF!"}},403,6,"83 ROBERT STEWART","21025","GROCERY SUPPLIES","OVERWRAP, FOIL"]
[null,null,null,null,null,null,null,null,null,null,null,null,null,null,null,null,null,null,null,null,null,null,null,null,null,null,null,null,null,null,null,null,"revised 11/5/2019",null,null,null,null,null,null,null,null,null,null,null,null,null,null,null,null,null,null,null,null,null,null,null,null,null,null,{"$f":"IF(AND(#REF!=404,OR(#REF!=\"15\",#REF!=\"19\",#REF!=\"29\",#REF!=\"50\",#REF! =\"65\",#REF!=\"69\",#REF!=\"79\",#REF!=\"99\")),1,0)","v":{"$error":"#REF!"}},404,8,"84 DAVID VOEKS","21040","PAPER/PLASTIC BAGS","OVERWRAP, PAPER"]
[null,null," I, THE SELLER, AGREE THAT UPON ACCEPTANCE OF THIS ITEM, TO FULLY GUARANTEE ITS SUCCESS.  AFTER 180 DAYS OF BEING PLACED IN THE RETAIL",null,null,null,null,null,null,null,null,null,null,null,null,null,null,null,null,null,null,null,null,null,null,null,null,null,null,null,null,null,null,null,null,null,null,null,null,null,null,null,null,null,null,null,null,null,null,null,null,null,null,null,null,null,null,null,null,{"$f":"IF(AND(#REF!=405,OR(#REF!=\"15\",#REF!=\"19\",#REF!=\"99\")),1,0)","v":{"$error":"#REF!"}},405,2,"85 ADONIS PASERIO","21041","CLEANING SUPPLIES","OVERWRAP, PLASTIC"]
[null,null,"STORES, MY NEW ITEM WEEKLY MOVEMENT WILL BE",null,null,null,null,null,null,null,null,null,null,null," ",null,null,"CASES. BI-LO HOLDINGS MAY RETURN THIS PRODUCT TO THEIR RECLAIM CENTER. INVENTORY",null,null,null,null,null,null,null,null,null,null,null,null,null,null,null,null,null,null,null,null,null,null,null,null,null,null,null,null,null,null,null,null,null,null,null,null,null,null,null,null,null,{"$f":"IF(AND(#REF!=411,OR(#REF!=\"25\",#REF!=\"40\",#REF!=\"41\",#REF!=\"42\",#REF! =\"43\",#REF!=\"44\",#REF!=\"45\")),1,0)","v":{"$error":"#REF!"}},411,7,"86 JOHN JANSEN","21043","SECURITY LABELS","PAPER"]
[null,null,"STILL IN THEIR DISTRIBUTION FACILITIES WILL BE RETURNED TO SUPPLIER AT THEIR EXPENSE. BI-LO HOLDINGS MAY BILL OUR COMPANY AT THE CURRENT",null,null,null,null,null,null,null,null,null,null,null,null,null,null,null,null,null,null,null,null,null,null,null,null,null,null,null,null,null,null,null,null,null,null,null,null,null,null,null,null,null,null,null,null,null,null,null,null,null,null,null,null,null,null,null,null,{"$f":"IF(AND(#REF!=415,OR(#REF!=\"17\",#REF!=\"24\",#REF!=\"25\",#REF!=\"40\",#REF! =\"41\",#REF!=\"42\",#REF!=\"43\",#REF!=\"44\",#REF!=\"45\",#REF!=\"46\",#REF!=\"47\",#REF!=\"53\",#REF!=\"54\",#REF!=\"55\",#REF!=\"56\",#REF!=\"57\",#REF!=\"58\",#REF!=\"59\",#REF!=\"60\",#REF!=\"61\",#REF!=\"62\")),1,0)","v":{"$error":"#REF!"}},415,14,"87 KEVIN COCHRAN","21045","PACKAGING/LABELS","PLASTIC TOP FOIL BASE"]
{"$rows_left_out":216}
{"sheet":"DSD Store Assortment and Cost","index":2,"n_rows":26,"n_cols":14,"rows_kept":26,"cut":false,"hidden":false,"merged":[[0,0,0,7],[5,0,5,7],[1,0,2,7],[0,10,0,14],[5,10,5,14]]}
["DSD VENDORS ONLY",null,null,null,null,null,null,null,null,null,"DSD VENDOR Cost"]
["Please indicate SEG banners to be serviced:"]
[]
["WINN-DIXIE",null,"BI-LO",null,"HARVEYS",null,"FRESCO Y MAS"]
[]
["Please list store numbers below to be serviced if servicing only a portion of a banner:",null,null,null,null,null,null,null,null,null,"Cost by Cost Zone"]
[null,null,null,null,null,null,null,null,null,null,"CZ 1",null,null,"CZ 21"]
[null,null,null,null,null,null,null,null,null,null,"CZ 2",null,null,"CZ 22"]
[null,null,null,null,null,null,null,null,null,null,"CZ 3",null,null,"CZ 23"]
[null,null,null,null,null,null,null,null,null,null,"CZ 4",null,null,"CZ 24"]
[null,null,null,null,null,null,null,null,null,null,"CZ 5",null,null,"CZ 25"]
[null,null,null,null,null,null,null,null,null,null,"CZ 6",null,null,"CZ 26"]
[null,null,null,null,null,null,null,null,null,null,"CZ 7",null,null,"CZ 27"]
[null,null,null,null,null,null,null,null,null,null,"CZ 8",null,null,"CZ 28"]
[null,null,null,null,null,null,null,null,null,null,"CZ 9",null,null,"CZ 29"]
[null,null,null,null,null,null,null,null,null,null,"CZ 10",null,null,"CZ 30"]
[null,null,null,null,null,null,null,null,null,null,"CZ 11",null,null,"CZ 31"]
[null,null,null,null,null,null,null,null,null,null,"CZ 12",null,null,"CZ 32"]
[null,null,null,null,null,null,null,null,null,null,"CZ 13",null,null,"CZ 33"]
[null,null,null,null,null,null,null,null,null,null,"CZ 14",null,null,"CZ 34"]
[null,null,null,null,null,null,null,null,null,null,"CZ 15",null,null,"CZ 35"]
[null,null,null,null,null,null,null,null,null,null,"CZ 16",null,null,"CZ 36"]
[null,null,null,null,null,null,null,null,null,null,"CZ 17",null,null,"CZ 37"]
[null,null,null,null,null,null,null,null,null,null,"CZ 18",null,null,"CZ 38"]
[null,null,null,null,null,null,null,null,null,null,"CZ 19",null,null,"CZ 39"]
[null,null,null,null,null,null,null,null,null,null,"CZ 20",null,null,"CZ 40"]

{"sheet":"DROP DOWN BOX SOURCE","index":3,"n_rows":372,"n_cols":26,"rows_kept":372,"cut":false,"hidden":true,"merged":[]}
["DEPARTMENT (DO NOT SORT LIST)","DAYS TO UPDATE CATEGORY (DO NOT SORT LIST)","PLANOGRAM UPDATE TYPE","CATEGORY OWNER","CATEGORIES","1Temporary Authorization","2Master Assortment Authorization",null,null,null,null,null,null,null,null,null,null,null,null,null,null,null,null,null,null,{"$f":"IF(ISERROR(VLOOKUP(#REF!,'DROP DOWN BOX SOURCE'!$A:$B,2,)),\"N/A\",VLOOKUP(#REF!,'DROP DOWN BOX SOURCE'!$A:$B,2,))","v":"N/A"}]
["N/A","N/A","N/A","AMANDA BLAKESLEE","ADULT INCONTINENCE","N/A","N/A",null,null,null,null,null,null,null,null,null,null,null,null,null,null,null,null,null,null,{"$f":"IF(ISERROR(VLOOKUP(#REF!,'DROP DOWN BOX SOURCE'!$A:$B,2,)),\"N/A\",VLOOKUP(#REF!,'DROP DOWN BOX SOURCE'!$A:$B,2,))","v":"N/A"}]
["GROCERY",77,"NEW ITEM CUT IN (NICI)","ANDY ANDREWS","ADULT NUTRITION","1 DISCONTINUED_ALL BANNERS & DC'S","2 BAKERY_ALL BANNERS & DC'S",null,null,null,null,null,null,null,null,null,null,null,null,null,null,null,null,null,null,{"$f":"IF(ISERROR(VLOOKUP(#REF!,'DROP DOWN BOX SOURCE'!$A:$B,2,)),\"N/A\",VLOOKUP(#REF!,'DROP DOWN BOX SOURCE'!$A:$B,2,))","v":"N/A"}]
["DAIRY",77,"***CATEGORY BUSINESS PLAN (CBP)","BARBARA TYREE","ADULT PARTY","1 SHIPPER-PALLET_ALL BANNERS & DC'S","2 DELI_ALL BANNERS & DC'S"]
["FROZEN",77,"***VENDOR FUNDED PROJECT","BRAD MULLINAX","AIR CARE","**STORE SPECIFIC ZPOG","2 DSD AIR FILTERS_ALL BANNERS & DC'S"]
["GENERAL MERCHANDISE",105,"CODE and/or UPC CHANGE ONLY (CC)","BRADLEY HANSMAN","AIR FILTERS",null,"2 DSD BEACH_ALL BANNERS & DC'S"]
["MEAT",42,null,"BROOKE LEVER","ANALGESICS",null,"2 DSD BEER_ALL BANNERS & DC'S"]
["DELI",42,null,"CARONLINE CAGE","ASIAN",null,"2 DSD BREAD AND SWEET GOODS_ALL BANNERS & DC'S"]
["BAKERY",42,null,"CASSIE KIRKLAND","AUTOMOTIVE",null,"2 DSD CHIPS_ALL BANNERS & DC'S"]
["PRODUCE",42,null,"CHERI SHULLEK","BABY ACCESSORIES -INFANT",null,"2 DSD CLIPS STRIPS_ALL BANNERS & DC'S"]
["NATURAL/ORGANIC",77,null,"CHERYL SEBER","BABY ACCESSORIES -TODDLER",null,"2 DSD CSD_ALL BANNERS & DC'S"]
["LOCAL",77,null,"CHIRSTOPHER KASZANITS","BABY DIAPERS",null,"2 DSD KOSHER_ALL BANNERS & DC'S"]
["TAXABLE GROCERY",77,null,"CHRIS ATTER","BABY FOOD",null,"2 DSD LOCAL_ALL BANNERS & DC'S"]
[null,null,null,"CHRISOPHER POTESTIO","BABY FORMULA",null,"2 DSD PRODUCE_ALL BANNERS & DC'S"]
[null,null,null,"CORIN OLDHAM","BABY HBC",null,"2 DSD SNACKS_ALL BANNERS & DC'S"]
["dropdown426",null,null,"DANIEL RYNDAK","BABY HYDRATION",null,"2 DSD SPIRITS_ALL BANNERS & DC'S"]
[null,null,null,"DANIELLE PEIRCE","BABY WIPES",null,"2 FIRELOGS_ALL BANNERS & DC'S"]
[null,null,null,"DAVID DAWSON","BADIA SPICES",null,"2 HARVEY DSD_TMM VENDOR_ALL"]
[null,null,null,"DEBORA DEEMS","BAKEWARE",null,"2 HURRICANE EMERGENCY_ALL BANNERS & DC'S"]
[null,null,null,"DEREK FREDERICKSON","BAKING NEEDS",null,"2 INDIAN_ALL BANNERS & DC'S"]
[null,null,null,"DEREK LOTT","BARWARE",null,"2 MARKET SEAFOOD_ALL BANNERS & DC'S"]
[null,null,null,"DEWAYNE RABON","BATH CARE",null,"2 MEAT_ALL BANNERS & DC'S"]
[null,null,null,"DOUG OWENBY","BATH PUFFS",null,"2 OWN BRANDS CC_ALL BANNERS & DCs"]
[null,null,null,"EMISAEL ALVAREZ","BATH TISSUE",null,"2 PHARMACY_ALL BANNERS & DC'S"]
[null,null,null,"FRANK THURLOW","BATTERIES",null,"2 SEASONAL CANDY_ALL BANNERS & DC'S"]
[null,null,null,"GARY EVANS","BEER",null,"2 SEASONAL DAIRY FROZEN_ALL BANNERS & DC'S"]
[null,null,null,"GREGORY MINADEO","BETTER FOR YOU - CHIPS",null,"2 SEASONAL GMD_ALL BANNERS & DC'S"]
[null,null,null,"HEATH NIXON","BETTER FOR YOU - COOKIES & CRACKERS",null,"2 SEASONAL GROCERY_ALL BANNERS AND DC'S"]
[null,null,null,"IAN SCHMID","BLEACH",null,"2 TOBACCO_ALL BANNERS & DC'S"]
[null,null,null,"JAMES BALISTRIERE","BOSNIAN",null,"2 UNFI_ALL BANNERS & DC'S"]
[null,null,null,"JANE HOUGHTON","BOX DINNERS"]
[null,null,null,"JANEL PLITT","BRAZILIAN"]
[null,null,null,"JASON REID","BREAD"]
[null,null,null,"JEFF ZUNICH","BRITISH"]
[null,null,null,"JENNIFER BRYNER","BUTTER & MARGARINE"]
[null,null,null,"JENNYFER DICKENSON","CAJUN SPICES"]
[null,null,null,"JEREMY LATRAVERSE","CAKE & BAKING MIXES"]
[null,null,null,"JERRY WEAVER","CAKE DECORATIONS"]
[null,null,null,"JOHN JANSEN","CANDLES"]
[null,null,null,"JOSH PIATEK","CANDY - CHECKLANE"]
[null,null,null,"KAREN LAGARDE","CANDY - INLINE"]
[null,null,null,"KATIE STOKES","CANDY - SPECIALTY"]
[null,null,null,"KATRINA PETERSON","CANNED & BOTTLED NECTAR"]
[null,null,null,"KELLY FAIRBROTHER","CANNED BEANS"]
[null,null,null,"KRISTINE HOUSEND","CANNED CHILI"]
[null,null,null,"LARRY ISOM","CANNED FISH"]
[null,null,null,"LESLIE MEYER","CANNED FRUIT"]
[null,null,null,"LINDSEY CAHILL","CANNED MEAT"]
[null,null,null,"MICHAEL CARTER","CANNED MILK"]
[null,null,null,"MICHAEL HINKLE","CANNED PASTA"]
[null,null,null,"MICHELLE MORRELL","CANNED TOMATOES"]
[null,null,null,"MIKE BOVE","CANNED VEGETABLES"]
[null,null,null,"MIKE RUSSELL","CANNING"]
[null,null,null,"NATASHA HAMILTON","CANNISTER SNACKS"]
[null,null,null,"NICOLE HATFIELD","CARRIBEAN COOKWARE"]
[null,null,null,"NICOLE LUCIANO","CAT FOOD - BAGGED"]
[null,null,null,"PAIGE LANGENDERFER","CAT FOOD - CANNED"]
[null,null,null,"PAUL TREMBLAY","CAT LITTER"]
[null,null,null,"PAULINA DESSOFFY","CELLPHONES"]
[null,null,null,"PETER REDMOND","CENTRAL AMERICAN"]
{"$rows_left_out":313}
{"sheet":"Shipper Component form","index":4,"n_rows":26,"n_cols":10,"rows_kept":26,"cut":false,"hidden":false,"merged":[[6,9,7,9],[0,0,0,6],[6,0,7,0],[6,1,7,1],[6,2,7,2],[6,3,7,3],[6,4,7,4],[6,5,7,5],[6,6,7,6]]}
["SHIPPER COMPONENT WORKSHEET"]
[null,"Display/Shpr","Display/Shpr",null,null,"Qty per","Display",null,null,"Display"]
[null," CODE","UPC","DISPLAY / PREPACK  DESCRIPTION",null,"Shipper","Cost",null,null,"Retail"]
[null,null,null,null,null,{"$f":"SUM(E9:E24)","v":0},{"$f":"SUM(G9:G24)","v":0},null,null,{"$f":"SUM(J9:J24)","v":0}]
[]
["DISPLAY CONTENTS"]
["Item Bar Code Image","SEG Code #","UPC "," Description","Qty per Display","Item Net  UnitCost","Display Cost",null,"Item","Display Retail"]
[null,null,null,null,null,null,null,null,"Retail"]
[null,null,null,null,null,null,{"$f":"E9*F9","v":0},null,null,{"$f":"I9*E9","v":0}]
[null,null,null,null,null,null,{"$f":"E10*F10","v":0},null,null,0]
[null,null,null,null,null,null,0,null,null,0]
[null,null,null,null,null,null,0,null,null,0]
[null,null,null,null,null,null,0,null,null,0]
[null,null,null,null,null,null,0,null,null,0]
[null,null,null,null,null,null,0,null,null,0]
[null,null,null,null,null,null,0,null,null,0]
[null,null,null,null,null,null,0,null,null,0]
[null,null,null,null,null,null,0,null,null,0]
[null,null,null,null,null,null,0,null,null,0]
[null,null,null,null,null,null,0,null,null,0]
[null,null,null,null,null,null,0,null,null,0]
[null,null,null,null,null,null,0,null,null,0]
[null,null,null,null,null,null,0,null,null,0]
[null,null,null,null,null,null,0,null,null,0]
[null,null,null,null,null,null,{"$f":"IF(E25>0,E25*F25,\" \")","v":" "}]
[null,null,null,null,null,null," "]